{"text_format":"1","workbook":"xlsx","n_sheets":8,"sheets":["R8 Designs 3-4","R8 Designs 5-7","R8 Runs","Input","R8 3 factors FF","R8 4 factors IV)","R8 5-7 factors III","Output"],"not_rendered":{"charts":3,"images":0,"macros":1,"external_links":0,"defined_names":9,"comments":0,"pivot_tables":0},"unopened":[],"bounds":{"document_bytes":16777216,"sheet_cells":100000,"rows_first":2000,"rows_last":500,"rows_between":2000,"halvings":0,"cell_chars":16384,"cell_head_chars":4096},"cells_cut":0,"cells_raw":0,"read":"whole","date_system":"1900"}

{"sheet":"R8 Designs 3-4","index":0,"n_rows":50,"n_cols":23,"rows_kept":50,"cut":false,"hidden":false,"merged":[[48,13,48,21],[49,13,49,21],[42,13,42,21],[43,13,43,21],[44,13,44,21],[45,13,45,21],[46,13,46,21],[47,13,47,21],[41,13,41,21],[30,13,30,21],[31,13,31,21],[32,13,32,21],[33,13,33,21],[34,13,34,21],[35,13,35,21],[36,13,36,21],[37,13,37,21],[38,13,38,21],[39,13,39,21],[40,13,40,21],[29,13,29,21],[10,3,10,8],[11,3,11,8],[12,3,12,8],[13,3,13,8],[14,3,14,8],[15,3,15,8],[24,13,24,21],[25,13,25,21],[26,13,26,21],[27,13,27,21],[28,13,28,21],[23,13,23,21]]}
["DOE_R8_1.0",null,null,null,null,null,null,null,null,"Author: Bo Svensmark, svensmark@plen.ku.dk, Analytical Chemistry, PLEN, 2015 - 2025",null,null,null,null,null,null,null,"Grey cells are protected"]
[null,null,null,null,null,null,null,null,null,null,null,null,null,null,null,null,null,"To unprotect: Review -> Unprotect Sheet"]
[null,"1) Fill in or correct the white cells in Table 1-5",null,null,null,null,null,null,null,null,"Table 1: Informations in free format"]
[null,"2) If you want to randomize click on Randomize design",null,null,null,null,null,null,null,null,"Table 2: Parameters that must be valid  (Ok)"]
[null,"3) When everything is ready click on  Make run tables",null,null,null,null,null,null,null,null,"Table 3: Factors and levels "]
[null,null,null,null,null,null,null,null,null,null,"Table 4: Assign group A-H to runs"]
[null,"4) After you finished the design copy the design save the spreadsheet with a new name",null,null,null,null,null,null,null,null,"Table 5: Comments in free format (1 line of any length)"]
[null,"    (Use Save As...)",null,null,null,null,null,null,null,null,null,null,null,null,null,null,"Method must be in the list of methods"]
[]
[null,"Table 1: Informations about the design",null,null,null,null,null,null,null,null,"Table 2: Design parameters",null,null,"Valid input",null,null,"Methods"]
{"$rows_left_out":41}
{"sheet":"R8 Designs 5-7","index":1,"n_rows":50,"n_cols":23,"rows_kept":50,"cut":false,"hidden":false,"merged":[[41,13,41,21],[30,13,30,21],[31,13,31,21],[32,13,32,21],[33,13,33,21],[34,13,34,21],[35,13,35,21],[36,13,36,21],[37,13,37,21],[38,13,38,21],[39,13,39,21],[40,13,40,21],[29,13,29,21],[10,3,10,8],[11,3,11,8],[12,3,12,8],[13,3,13,8],[14,3,14,8],[15,3,15,8],[24,13,24,21],[25,13,25,21],[26,13,26,21],[27,13,27,21],[28,13,28,21],[23,13,23,21]]}
[{"$f":"'R8 Designs 3-4'!A1","v":"DOE_R8_1.0"},null,null,null,null,null,null,null,null,{"$f":"'R8 Designs 3-4'!$J$1","v":"Author: Bo Svensmark, svensmark@plen.ku.dk, Analytical Chemistry, PLEN, 2015 - 2025"},null,null,null,null,null,null,null,"Grey cells are protected"]
[null,null,null,null,null,null,null,null,null,null,null,null,null,null,null,null,null,"To unprotect: Review -> Unprotect Sheet"]
[null,"1) Fill in or correct the white cells in Table 1-5",null,null,null,null,null,null,null,null,"Table 1: Informations in free format"]
[null,"2) If you want to randomize click on Randomize design",null,null,null,null,null,null,null,null,"Table 2: Parameters that must be valid  (Ok)"]
[null,"3) When everything is ready click on  Make run tables",null,null,null,null,null,null,null,null,"Table 3: Factors and levels "]
[null,null,null,null,null,null,null,null,null,null,"Table 4: Assign group A-H to runs"]
[null,"4) After you finished the design copy the design and run sheet to a new spreadsheet",null,null,null,null,null,null,null,null,"Table 5: Comments in free format (1 line of any length)"]
[null,"5) Save the new sheet with a name like DoE_SPME_Group_X",null,null,null,null,null,null,null,null,null,null,null,null,null,null,"Method must be in the list of methods"]
[]
[null,"Table 1: Informations about the design",null,null,null,null,null,null,null,null,"Table 2: Design parameters",null,null,"Valid input",null,null,"Methods"]
{"$rows_left_out":41}
{"sheet":"R8 Runs","index":2,"n_rows":0,"n_cols":0,"rows_kept":0,"cut":false,"hidden":false,"merged":[[5,8,5,13],[0,8,0,13],[1,8,1,13],[2,8,2,13],[3,8,3,13],[4,8,4,13],[17,8,17,13],[6,8,6,13],[7,8,7,13],[8,8,8,13],[9,8,9,13],[10,8,10,13],[11,8,11,13],[12,8,12,13],[13,8,13,13],[14,8,14,13],[15,8,15,13],[16,8,16,13],[29,8,29,13],[18,8,18,13],[19,8,19,13],[20,8,20,13],[21,8,21,13],[22,8,22,13],[23,8,23,13],[24,8,24,13],[25,8,25,13],[26,8,26,13],[27,8,27,13],[28,8,28,13],[41,8,41,13],[30,8,30,13],[31,8,31,13],[32,8,32,13],[33,8,33,13],[34,8,34,13],[35,8,35,13],[36,8,36,13],[37,8,37,13],[38,8,38,13],[39,8,39,13],[40,8,40,13],[53,8,53,13],[42,8,42,13],[43,8,43,13],[44,8,44,13],[45,8,45,13],[46,8,46,13],[47,8,47,13],[48,8,48,13],[49,8,49,13],[50,8,50,13],[51,8,51,13],[52,8,52,13],[60,8,60,13],[61,8,61,13],[54,8,54,13],[55,8,55,13],[56,8,56,13],[57,8,57,13],[58,8,58,13],[59,8,59,13]]}

{"sheet":"Input","index":3,"n_rows":149,"n_cols":36,"rows_kept":149,"cut":false,"hidden":false,"merged":[]}
[{"$f":"'R8 Designs 3-4'!A1","v":"DOE_R8_1.0"},"Normalize?",null,{"$f":"IF(D100<>\"\",D100,\"\")","v":""},null,{"$f":"IF(F100<>\"\",F100,\"\")","v":""},null,{"$f":"IF(H100<>\"\",H100,\"\")","v":""},null,{"$f":"IF(J100<>\"\",J100,\"\")","v":""},null,{"$f":"IF(L100<>\"\",L100,\"\")","v":""},null,{"$f":"IF(N100<>\"\",N100,\"\")","v":""},null,{"$f":"IF(P100<>\"\",P100,\"\")","v":""},null,{"$f":"IF(R100<>\"\",R100,\"\")","v":""},null,{"$f":"IF(T100<>\"\",T100,\"\")","v":""},"","","","","",null,{"$f":"'R8 Designs 3-4'!$J$1","v":"Author: Bo Svensmark, svensmark@plen.ku.dk, Analytical Chemistry, PLEN, 2015 - 2025"}]
[null,"Yes=1 No=0",1,null,{"$f":"IF(E100<>\"\",E100,\"\")","v":""},null,{"$f":"IF(G100<>\"\",G100,\"\")","v":""},null,{"$f":"IF(I100<>\"\",I100,\"\")","v":""},null,{"$f":"IF(K100<>\"\",K100,\"\")","v":""},null,{"$f":"IF(M100<>\"\",M100,\"\")","v":""},null,{"$f":"IF(O100<>\"\",O100,\"\")","v":""},null,{"$f":"IF(Q100<>\"\",Q100,\"\")","v":""},null,"","","","","","","","",{"$f":"IF(AA100<>\"\",AA100,\"\")","v":""},null,null,null,null,{"$f":"IF(AF104<>\"\",AF104,\"\")","v":""}]
["Select (1/0) ?",0,1,0,0,0,0,0,0,0,0,0,null,null,null,null,null,null,null,null,null,null,null,null,null,null,0,0,0,3]
[null,"Mean(area)",{"$f":"MAX(D4:Z4)","v":0},{"$f":"IF(D3>0,AVERAGE(D101:D177),\"\")","v":""},"","",{"$f":"IF(G3>0,AVERAGE(G101:G177),\"\")","v":""},"","","","","","","","","","","","","","","","","","","","In these columns you may add",null,null,null,null,"1) Copy the response data to the white cells surronded by yellow in cell C100:Z136 (2nd replicate to C141:Z176)"]
[null,"Max(area)",null,{"$f":"IF(D3>0,MAX(D101:D177),\"\")","v":""},"","",{"$f":"IF(G3>0,MAX(G101:G177),\"\")","v":""},"","","","","","","","","","","","","","","","","","","","calculated variables to include in"]
[null,"Min(area)",null,{"$f":"IF(D3>0,MIN(D101:D177),\"\")","v":""},"","",{"$f":"IF(G3>0,MIN(G101:G177),\"\")","v":""},"","","","","","","","","","","","","","","","","","","","the analysis. Could be harmonic or",null,null,null,null,"2) If you do not want to normalize data, change 1 in cell C3 to 0"]
[null,"Relative area",null,{"$f":"IF(D3>0,100*D4/$C$4,\"\")","v":""},{"$f":"IF(E3>0,100*E4/$C$4,\"\")","v":""},"","","","","","","","","","","","","","","","","","","","","","geometric mean, or ???"]
[null,"Mean(norm)",null,{"$f":"IF(D3>0,AVERAGE(D11:D46,D51:D86),\"\")","v":""},{"$f":"IF(E3>0,AVERAGE(E11:E46,E51:E86),\"\")","v":""},"","","","","","","","","","","","","","","","","","","","","","Remember to put a name for the",null,null,null,null,"3) In row 3 white cells enter a 1 for compounds which should be selected for analysis - and 0 if you want to skip them"]
[null,"Min(norm)",null,{"$f":"IF(D3>0,MIN(D11:D46,D51:D86),\"\")","v":""},{"$f":"IF(E3>0,MIN(E11:E46,E51:E86),\"\")","v":""},"","","","","","","","","","","","","","","","","","","","","","variable in the first row",null,null,null,null,null,"After analysis, 1 is changed to 2. "]
["Label","Max","Mean",{"$f":"IF(D100<>\"\",D100,\"\")","v":""},"","",{"$f":"IF(G100<>\"\",G100,\"\")","v":""},"","","","","","","","","","","","","","","","","","","",null,null,null,null,null,null,"To re-analyse data, change 2 to 1 and repeat the analysis"]
{"$rows_left_out":140}
{"sheet":"R8 3 factors FF","index":4,"n_rows":87,"n_cols":37,"rows_kept":87,"cut":false,"hidden":false,"merged":[]}
[{"$f":"'R8 Designs 3-4'!A1","v":"DOE_R8_1.0"},null,null,null,"2^3","Full factor design",null,"No confounding",null,"3 main effects",null,"4 interactions",null,null,null,null,null,null,null,null,null,{"$f":"'R8 Designs 3-4'!$J$1","v":"Author: Bo Svensmark, svensmark@plen.ku.dk, Analytical Chemistry, PLEN, 2015 - 2025"}]
[]
[null,"1) Enter parameters in sheet R8 Designs 3-4",null,null,null,null,"(Input in white cells only)",null,null,null,"This design is for 3 main effects and all interactions",null,null,null,null,{"$f":"IF('R8 Designs 3-4'!M13=3,3,0)","v":0},null,"No confounding",null,null,null,"This sheet can also be used in manual mode: "]
[null,"2) Enter all result in sheets \"Input\" and fill 1 or 0  in row 3 in \"Input\"",null,null,null,null,null,null,null,null,null,null,null,null,null,null,null,null,null,null,null,null,"Enter results of the runs in the table F18:I21 and F22:G29"]
[null,"3) Click on \"Start\" to load the first case.  Check that Next in cell K12 is 1",null,null,null,null,null,null,null,null,"Centerpoints may be omitted.",null,null,null,null,null,null,null,null,null,null,null,"Click on \"Update sheet\" to calculate results"]
[null,"4) See the results here",null,null,null,null,null,null,null,null,"Only one replicate is needed.",null,null,null,null,null,null,null,null,null,null,null,"You may set confidense interval manually, see below"]
[null,"5) Set confidence intervals for effects manually (see notes --->)",null,null,null,null,null,null,null,null,"With only one replicate and less than 2 centerpoints",null,null,null,null,null,null,null,null,null,null,null,"Click on \"Save\" to save results to sheet \"Output\""]
[null,"6) Click \"Save\" or \"Save and load next analyte\" to save results and proceed",null,null,null,null,null,null,null,null,"no statistics is possible, but the effects will be calculated"]
[null,null,null,null,null,null,null,null,null,null,null,null,null,null,null,null,null,null,null,null,null,"All cells not intended for user input are locked. To unlock go to Review and click Unprotect Sheet"]
["Design","Factor",1,2,3,"No of center points:",null,{"$f":"'R8 Designs 3-4'!M14","v":0},null,{"$f":"IF(O16=\"No\",\"Results are NOT saved\",\"Results are saved in sheet Output\")","v":"Results are saved in sheet Output"},null,null,null,null,null,null,null,null,null,null,null,"Most cells are shown with 2 significant digits. You may want to cange that for small values"]
{"$rows_left_out":78}
{"sheet":"R8 4 factors IV)","index":5,"n_rows":88,"n_cols":37,"rows_kept":88,"cut":false,"hidden":false,"merged":[]}
[{"$f":"'R8 Designs 3-4'!A1","v":"DOE_R8_1.0"},null,null,null,"2^(4-1)","Half fraction design",null,"Resolution IV",null,"3 main effects",null,"Main effects confounded with 3-factor interactions",null,null,null,null,null,null,null,null,null,{"$f":"'R8 Designs 3-4'!$J$1","v":"Author: Bo Svensmark, svensmark@plen.ku.dk, Analytical Chemistry, PLEN, 2015 - 2025"}]
[]
[null,"1) Enter parameters in sheet R8 Designs 3-4",null,null,null,null,"(Input in white cells only)",null,null,null,"This design is for 4 main effects and some interactions",null,null,null,null,{"$f":"IF('R8 Designs 3-4'!M13=4,4,0)","v":0},null,"Confounding:",null,null,null,"This sheet can also be used in manual mode: "]
[null,"2) Enter all result in sheets \"Input\" and fill 1 or 0  in row 3 in \"Input\"",null,null,null,null,null,null,null,null,null,null,null,null,null,null,null,"Mean = 1234",null,null,null,null,"Enter results of the runs in the table F18:I21 and F22:G29"]
[null,"3) Click on \"Start\" to load the first case.  Check that Next in cell K12 is 1",null,null,null,null,null,null,null,null,"Centerpoints may be omitted.",null,null,null,null,null,null,"1 = 234",null,null,null,null,"Click on \"Update sheet\" to calculate results"]
[null,"4) See the results here",null,null,null,null,null,null,null,null,"Only one replicate is needed.",null,null,null,null,null,null,"2 = 134",null,null,null,null,"You may set confidense interval manually, see below"]
[null,"5) Set confidence intervals for effects manually (see notes --->)",null,null,null,null,null,null,null,null,"With only one replicate and less than 2 centerpoints",null,null,null,null,null,null,"3 = 124",null,null,null,null,"Click on \"Save\" to save results to sheet \"Output\""]
[null,"6) Click \"Save\" or \"Save and load next analyte\" to save results and proceed",null,null,null,null,null,null,null,null,"no statistics is possible, but the effects will be calculated",null,null,null,null,null,null,"4 = 123"]
[null,null,null,null,null,null,null,null,null,null,null,null,null,null,null,null,null,"12 = 34",null,null,null,"All cells not intended for user input are locked. To unlock go to Review and click Unprotect Sheet"]
["Design","Factor",1,2,3,4,"No of center points:",null,{"$f":"'R8 Designs 3-4'!M14","v":0},null,{"$f":"IF(P16=\"No\",\"Results are NOT saved\",\"Results are saved in sheet Output\")","v":"Results are saved in sheet Output"},null,null,null,null,null,null,"13 = 24",null,null,null,"Most cells are shown with 2 significant digits. You may want to cange that for small values"]
{"$rows_left_out":79}
{"sheet":"R8 5-7 factors III","index":6,"n_rows":88,"n_cols":37,"rows_kept":88,"cut":false,"hidden":false,"merged":[]}
[{"$f":"'R8 Designs 3-4'!A1","v":"DOE_R8_1.0"},null,null,null,"2^(F#-X)","X fraction design",null,"Screening res III",null,"5-7main effects",null,"Main effects confounded with 2-factor interactions",null,null,null,null,null,null,null,null,null,{"$f":"'R8 Designs 3-4'!$J$1","v":"Author: Bo Svensmark, svensmark@plen.ku.dk, Analytical Chemistry, PLEN, 2015 - 2025"}]
[]
[null,"1) Enter parameters in sheet R8 Designs 5-7",null,null,null,null,"(Input in white cells only)",null,null,null,"This design may be used with 5, 6 or 7 factors",null,null,null,null,{"$f":"IF(AND('R8 Designs 5-7'!M13>4,'R8 Designs 5-7'!M13<8),'R8 Designs 5-7'!M13,0)","v":0},null,"Confounding:",null,null,null,"This sheet can also be used in manual mode: "]
[null,"2) Enter all result in sheets \"Input\" and fill 1 or 0  in row 3 in \"Input\"",null,null,null,null,null,null,null,null,"No interactions can be trusted",null,null,null,null,null,null,"All main effects are confounded",null,null,null,null,"Enter results of the runs in the table F18:I21 and F22:G29"]
[null,"3) Click on \"Start\" to load the first case.  Check that Next in cell K12 is 1",null,null,null,null,null,null,null,null,"Centerpoints may be omitted.",null,null,null,null,null,null,"with 2-factor interactions and ",null,null,null,null,"Click on \"Update sheet\" to calculate results"]
[null,"4) See the results here",null,null,null,null,null,null,null,null,"Only one replicate is needed.",null,null,null,null,null,null,"higher order interactions.",null,null,null,null,"You may set confidense interval manually, see below"]
[null,"5) Set confidence intervals for effects manually (see notes --->)",null,null,null,null,null,null,null,null,"With only one replicate and less than 2 centerpoints",null,null,null,null,null,null,"For 5, 6 and 7 main factors, the",null,null,null,null,"Click on \"Save\" to save results to sheet \"Output\""]
[null,"6) Click \"Save\" or \"Save and load next analyte\" to save results and proceed",null,null,null,null,null,null,null,null,"no statistics is possible, but the effects will be calculated",null,null,null,null,null,null,"confounding is with 1, 2 and 3"]
[null,null,null,null,null,null,null,null,null,null,null,null,null,null,null,null,null,"2-factor interactions respectively",null,null,null,"All cells not intended for user input are locked. To unlock go to Review and click Unprotect Sheet"]
["Design","Factor",1,2,3,4,5,6,7,"No of center points:",null,{"$f":"'R8 Designs 5-7'!M14","v":0},null,{"$f":"IF(S16=\"No\",\"Results are NOT saved\",\"Results are saved in sheet Output\")","v":"Results are saved in sheet Output"},null,null,null,null,null,null,null,"Most cells are shown with 2 significant digits. You may want to cange that for small values"]
{"$rows_left_out":79}
{"sheet":"Output","index":7,"n_rows":48,"n_cols":16,"rows_kept":48,"cut":false,"hidden":false,"merged":[]}
[{"$f":"Input!A1","v":"DOE_R8_1.0"},null,null,null,null,null,null,null,null,null,null,null,null,null,null,{"$f":"'R8 Designs 3-4'!$J$1","v":"Author: Bo Svensmark, svensmark@plen.ku.dk, Analytical Chemistry, PLEN, 2015 - 2025"}]
[]
[]
[]
[]
[null,null,null,null,null,"No"]
[null,null,null,null,null,"Analyte"]
[null,null,null,null,null,"Relative area"]
[null,null,null,null,null,"Comments"]
["Factor","Name","Unit","Low","C1","C2","High"]
{"$rows_left_out":38}