{"text_format":"1","workbook":"xlsx","n_sheets":8,"sheets":["R16 Designs 4-5","R16 Designs 6-8","R16 Runs","Input","R16 4 factors FF","R16 5 factors V","R16 6-8 factors IV","Output"],"not_rendered":{"charts":3,"images":0,"macros":1,"external_links":0,"defined_names":9,"comments":0,"pivot_tables":0},"unopened":[],"bounds":{"document_bytes":16777216,"sheet_cells":100000,"rows_first":2000,"rows_last":500,"rows_between":2000,"halvings":0,"cell_chars":16384,"cell_head_chars":4096},"cells_cut":0,"cells_raw":0,"read":"whole","date_system":"1900"}

{"sheet":"R16 Designs 4-5","index":0,"n_rows":58,"n_cols":24,"rows_kept":58,"cut":false,"hidden":false,"merged":[[54,14,54,22],[55,14,55,22],[56,14,56,22],[57,14,57,22],[48,14,48,22],[49,14,49,22],[50,14,50,22],[51,14,51,22],[52,14,52,22],[53,14,53,22],[47,14,47,22],[36,14,36,22],[37,14,37,22],[38,14,38,22],[39,14,39,22],[40,14,40,22],[41,14,41,22],[42,14,42,22],[43,14,43,22],[44,14,44,22],[45,14,45,22],[46,14,46,22],[35,14,35,22],[24,14,24,22],[25,14,25,22],[26,14,26,22],[27,14,27,22],[28,14,28,22],[29,14,29,22],[30,14,30,22],[31,14,31,22],[32,14,32,22],[33,14,33,22],[34,14,34,22],[23,14,23,22],[15,3,15,9],[10,3,10,9],[11,3,11,9],[12,3,12,9],[13,3,13,9],[14,3,14,9]]}
["DOE_R16_Beta",null,null,null,null,null,null,null,null,null,{"$f":"Input!AA1","v":"Author: Bo Svensmark, svensmark@plen.ku.dk, Analytical Chemistry, PLEN, 2015 - 2025"},null,null,null,null,null,null,null,"Grey cells are protected"]
[null,null,null,null,null,null,null,null,null,null,null,null,null,null,null,null,null,null,"To unprotect: Review -> Unprotect Sheet"]
[null,"1) Fill in or correct the white cells in Table 1-5",null,null,null,null,null,null,null,null,null,"Table 1: Informations in free format"]
[null,"2) If you want to randomize click on Randomize design",null,null,null,null,null,null,null,null,null,"Table 2: Parameters that must be valid "]
[null,"3) When everything is ready click on  Make run tables",null,null,null,null,null,null,null,null,null,"Table 3: Factors and levels "]
[null,null,null,null,null,null,null,null,null,null,null,"Table 4: Assign group A-H to runs"]
[null,"4) After you finished the design copy the design save the spreadsheet with a new name Save As…",null,null,null,null,null,null,null,null,null,"Table 5: Comments in free format (1 line of any length)"]
[null,null,null,null,null,null,null,null,null,null,null,null,null,null,null,null,null,"Method must be in the list of methods"]
[]
[null,"Table 1: Informations about the design",null,null,null,null,null,null,null,null,null,"Table 2: Design parameters",null,null,"Valid input",null,null,"Methods"]
{"$rows_left_out":49}
{"sheet":"R16 Designs 6-8","index":1,"n_rows":58,"n_cols":24,"rows_kept":58,"cut":false,"hidden":false,"merged":[[54,14,54,22],[55,14,55,22],[56,14,56,22],[57,14,57,22],[48,14,48,22],[49,14,49,22],[50,14,50,22],[51,14,51,22],[52,14,52,22],[53,14,53,22],[47,14,47,22],[36,14,36,22],[37,14,37,22],[38,14,38,22],[39,14,39,22],[40,14,40,22],[41,14,41,22],[42,14,42,22],[43,14,43,22],[44,14,44,22],[45,14,45,22],[46,14,46,22],[35,14,35,22],[24,14,24,22],[25,14,25,22],[26,14,26,22],[27,14,27,22],[28,14,28,22],[29,14,29,22],[30,14,30,22],[31,14,31,22],[32,14,32,22],[33,14,33,22],[34,14,34,22],[23,14,23,22],[15,3,15,9],[10,3,10,9],[11,3,11,9],[12,3,12,9],[13,3,13,9],[14,3,14,9]]}
[{"$f":"'R16 Designs 4-5'!A1","v":"DOE_R16_Beta"},null,null,null,null,null,null,null,null,null,null,{"$f":"Input!AA1","v":"Author: Bo Svensmark, svensmark@plen.ku.dk, Analytical Chemistry, PLEN, 2015 - 2025"},null,null,null,null,null,null,"Grey cells are protected"]
[null,null,null,null,null,null,null,null,null,null,null,null,null,null,null,null,null,null,"To unprotect: Review -> Unprotect Sheet"]
[null,"1) Fill in or correct the white cells in Table 1-5",null,null,null,null,null,null,null,null,null,"Table 1: Informations in free format"]
[null,"2) If you want to randomize click on Randomize design",null,null,null,null,null,null,null,null,null,"Table 2: Parameters that must be valid"]
[null,"3) When everything is ready click on  Make run tables",null,null,null,null,null,null,null,null,null,"Table 3: Factors and levels "]
[null,null,null,null,null,null,null,null,null,null,null,"Table 4: Assign group A-H to runs"]
[null,"4) After you finished the design copy the design and run sheet to a new spreadsheet",null,null,null,null,null,null,null,null,null,"Table 5: Comments in free format (1 line of any length)"]
[null,"5) Save the new sheet with a name like DoE_SPME_Group_X",null,null,null,null,null,null,null,null,null,null,null,null,null,null,null,"Method must be in the list of methods"]
[]
[null,"Table 1: Informations about the design",null,null,null,null,null,null,null,null,null,"Table 2: Design parameters",null,null,"Valid input",null,null,"Methods"]
{"$rows_left_out":49}
{"sheet":"R16 Runs","index":2,"n_rows":0,"n_cols":0,"rows_kept":0,"cut":false,"hidden":false,"merged":[[5,9,5,13],[0,9,0,13],[1,9,1,13],[2,9,2,13],[3,9,3,13],[4,9,4,13],[17,9,17,13],[6,9,6,13],[7,9,7,13],[8,9,8,13],[9,9,9,13],[10,9,10,13],[11,9,11,13],[12,9,12,13],[13,9,13,13],[14,9,14,13],[15,9,15,13],[16,9,16,13],[29,9,29,13],[18,9,18,13],[19,9,19,13],[20,9,20,13],[21,9,21,13],[22,9,22,13],[23,9,23,13],[24,9,24,13],[25,9,25,13],[26,9,26,13],[27,9,27,13],[28,9,28,13],[41,9,41,13],[30,9,30,13],[31,9,31,13],[32,9,32,13],[33,9,33,13],[34,9,34,13],[35,9,35,13],[36,9,36,13],[37,9,37,13],[38,9,38,13],[39,9,39,13],[40,9,40,13],[53,9,53,13],[42,9,42,13],[43,9,43,13],[44,9,44,13],[45,9,45,13],[46,9,46,13],[47,9,47,13],[48,9,48,13],[49,9,49,13],[50,9,50,13],[51,9,51,13],[52,9,52,13],[60,9,60,13],[61,9,61,13],[54,9,54,13],[55,9,55,13],[56,9,56,13],[57,9,57,13],[58,9,58,13],[59,9,59,13]]}

{"sheet":"Input","index":3,"n_rows":149,"n_cols":51,"rows_kept":149,"cut":false,"hidden":false,"merged":[]}
[{"$f":"'R16 Designs 4-5'!A1","v":"DOE_R16_Beta"},"Normalize?","Analyte",{"$f":"IF(D100<>\"\",D100,\"\")","v":""},null,{"$f":"IF(F100<>\"\",F100,\"\")","v":""},null,{"$f":"IF(H100<>\"\",H100,\"\")","v":""},null,{"$f":"IF(J100<>\"\",J100,\"\")","v":""},null,{"$f":"IF(L100<>\"\",L100,\"\")","v":""},null,{"$f":"IF(N100<>\"\",N100,\"\")","v":""},null,{"$f":"IF(P100<>\"\",P100,\"\")","v":""},null,{"$f":"IF(R100<>\"\",R100,\"\")","v":""},null,{"$f":"IF(T100<>\"\",T100,\"\")","v":""},"","","","","","","Author: Bo Svensmark, svensmark@plen.ku.dk, Analytical Chemistry, PLEN, 2015 - 2025"]
[null,"Yes=1 No = 0",1,null,{"$f":"IF(E100<>\"\",E100,\"\")","v":""},null,"",null,"",null,"",null,"",null,"",null,"",null,"","","","","","","","",{"$f":"IF(AA100<>\"\",AA100,\"\")","v":""},null,null,null,null,"","","","","","","","",{"$f":"IF(AN102<>\"\",AN102,\"\")","v":""},{"$f":"IF(AO102<>\"\",AO102,\"\")","v":""},{"$f":"IF(AP102<>\"\",AP102,\"\")","v":""},{"$f":"IF(AQ102<>\"\",AQ102,\"\")","v":""},"","","","","","","",""]
["Select (1/0) ?",0,1,0,0,0,0,0,0,0,0,0,0,0,0,0,0,0,null,null,null,null,null,null,null,null,0,0,0,3]
["Max(mean)","Mean(area)",{"$f":"MAX(D4:Z4)","v":0},{"$f":"IF(D3>0,AVERAGE(D101:D177),\"\")","v":""},"","","","","","","","","","","","","","","","","","","","","","","In these columns you may add",null,null,null,null,"1) Copy the response data to the white cells surronded by yellow in cell C100:Z136 (2nd replicate to C141:Z176)"]
[null,"Max(area)",null,{"$f":"IF(D3>0,MAX(D101:D177),\"\")","v":""},"","","","","","","","","","","","","","","","","","","","","","","calculated variables to include in"]
[null,"Min(area)",null,{"$f":"IF(D3>0,MIN(D101:D177),\"\")","v":""},"","","","","","","","","","","","","","","","","","","","","","","the analysis. Could be harmonic or",null,null,null,null,"2) If you do not want to normalize data, change 1 in cell C3 to 0"]
[null,"Relative area",null,{"$f":"IF(D3>0,100*D4/$C$4,\"\")","v":""},{"$f":"IF(E3>0,100*E4/$C$4,\"\")","v":""},"","","","","","","","","","","","","","","","","","","","","","geometric mean, or ???"]
[null,"Mean(norm)",null,{"$f":"IF(D3>0,MIN(D11:D46,D51:D86),\"\")","v":""},"","","","","","","","","","","","","","","","","","","","","","","Remember to put a name for the",null,null,null,null,"3) In row 3 white cells enter a 1 for compounds which should be selected for analysis - and 0 if you want to skip them"]
[null,"Min(norm)",null,{"$f":"IF(D3>0,AVERAGE(D11:D46,D51:D86),\"\")","v":""},"","","","","","","","","","","","","","","","","","","","","","","variable in the first row",null,null,null,null,null,"After analysis, 1 is changed to 2. "]
["Label","Max","Mean",{"$f":"IF(D100<>\"\",D100,\"\")","v":""},"","","","","","","","","","","","","","","","","","","","","","",null,null,null,null,null,null,"To re-analyse data, change 2 to 1 and repeat the analysis"]
{"$rows_left_out":140}
{"sheet":"R16 4 factors FF","index":4,"n_rows":127,"n_cols":37,"rows_kept":127,"cut":false,"hidden":false,"merged":[]}
[{"$f":"Input!A1","v":"DOE_R16_Beta"},null,null,null,"2^4","Full factor design",null,"No confounding",null,null,"4 main effects",null,"11 interactions",null,null,null,null,null,null,null,null,{"$f":"Input!AA1","v":"Author: Bo Svensmark, svensmark@plen.ku.dk, Analytical Chemistry, PLEN, 2015 - 2025"}]
[]
[null,"1) Enter parameters in sheet \"R16 Designs 4-5\"",null,null,null,null,"(Input in white cells only)",null,null,null,null,"This design is for 4 main effects with all interactions",null,null,null,null,{"$f":"IF('R16 Designs 4-5'!N13=4,4,0)","v":0},null,"NO confounding",null,null,"This sheet can also be used in manual mode: "]
[null,"2) Enter all result in sheets \"Input\" and fill 1 or 0  in row 3 in \"Input\"",null,null,null,null,null,null,null,null,null,null,null,null,null,null,null,null,null,null,null,null,"Enter results of the runs in the table F18:I21 and F22:G29"]
[null,"3) Click on \"Start\" to load the first case.  Check that Next in cell K12 is 1",null,null,null,null,null,null,null,null,null,"Centerpoints may be omitted.",null,null,null,null,null,null,null,null,null,null,"Click on \"Update sheet\" to calculate results"]
[null,"4) See the results here",null,null,null,null,null,null,null,null,null,null,null,null,null,null,null,null,null,null,null,null,"You may set confidense interval manually, see below"]
[null,"5) Set confidence intervals for effects manually (see notes --->)",null,null,null,null,null,null,null,null,null,null,null,null,null,null,null,null,null,null,null,null,"Click on \"Save\" to save results to sheet \"Output\""]
[null,"6) Click \"Save\" or \"Save and load next analyte\" to save results and proceed"]
[null,null,null,null,null,null,null,null,null,null,null,null,null,null,null,null,null,null,null,null,null,"Most cells are shown with 2 significant digits. You may want to cange that for small values"]
["Design","Factor",1,2,3,4,"No of center points:",null,{"$f":"'R16 Designs 4-5'!N14","v":0},null,{"$f":"IF(P16=\"No\",\"Results are NOT saved\",\"Results are saved in sheet Output\")","v":"Results are saved in sheet Output"}]
{"$rows_left_out":118}
{"sheet":"R16 5 factors V","index":5,"n_rows":127,"n_cols":37,"rows_kept":127,"cut":false,"hidden":false,"merged":[]}
[{"$f":"'R16 Designs 4-5'!A1","v":"DOE_R16_Beta"},null,null,null,"2^(5-1)","Fractional factor design",null,null,"Resolution V",null,"5 main effects",null,"10 interactions",null,null,null,"Generator: 5 = 1234",null,null,null,null,{"$f":"Input!AA1","v":"Author: Bo Svensmark, svensmark@plen.ku.dk, Analytical Chemistry, PLEN, 2015 - 2025"}]
[]
[null,"1) Enter parameters in sheet \"R16 Designs 4-5\"",null,null,null,null,"(Input in white cells only)",null,null,null,null,"This design is for 5 main effects and 2-factor interactions",null,null,null,null,{"$f":"IF('R16 Designs 4-5'!N13=5,5,0)","v":0},null,"Confounding:",null,null,"This sheet can also be used in manual mode: "]
[null,"2) Enter all result in sheets \"Input\" and fill 1 or 0  in row 3 in \"Input\"",null,null,null,null,null,null,null,null,null,null,null,null,null,null,null,null,"See Effects Table",null,null,null,"Enter results of the runs in the table F18:I21 and F22:G29"]
[null,"3) Click on \"Start\" to load the first case.  Check that Next in cell K12 is 1",null,null,null,null,null,null,null,null,null,"Centerpoints may be omitted.",null,null,null,null,null,null,null,null,null,null,"Click on \"Update sheet\" to calculate results"]
[null,"4) See the results here",null,null,null,null,null,null,null,null,null,"With no replicates, no statistics is calculated",null,null,null,null,null,null,null,null,null,null,"You may set confidense interval manually, see below"]
[null,"5) Set confidence intervals for effects manually (see notes --->)",null,null,null,null,null,null,null,null,null,null,null,null,null,null,null,null,null,null,null,null,"Click on \"Save\" to save results to sheet \"Output\""]
[null,"6) Click \"Save\" or \"Save and load next analyte\" to save results and proceed"]
[null,null,null,null,null,null,null,null,null,null,null,null,null,null,null,null,null,null,null,null,null,"Most cells are shown with 2 significant digits. You may want to cange that for small values"]
["Design","Factor",1,2,3,4,5,"No of center points:",null,{"$f":"'R16 Designs 4-5'!N14","v":0},null,{"$f":"IF(Q16=\"No\",\"Results are NOT saved\",\"Results are saved in sheet Output\")","v":"Results are saved in sheet Output"}]
{"$rows_left_out":118}
{"sheet":"R16 6-8 factors IV","index":6,"n_rows":127,"n_cols":37,"rows_kept":127,"cut":false,"hidden":false,"merged":[]}
[{"$f":"'R16 Designs 4-5'!A1","v":"DOE_R16_Beta"},null,null,null,"2^(8-4)","Fractional factor design",null,null,"Resolution IV",null,"6-8 main effects",null,"Interactions too confounded",null,null,"Generators: 5 = 234    6 = 134    7 = 123    8 = 124",null,null,null,null,null,null,{"$f":"Input!AA1","v":"Author: Bo Svensmark, svensmark@plen.ku.dk, Analytical Chemistry, PLEN, 2015 - 2025"}]
[]
[null,"1) Enter parameters in sheet \"R16 Designs 6-8\"",null,null,null,null,"(Input in white cells only)",null,null,null,null,"This design is for 6 to 8 main effects. ",null,null,null,null,{"$f":"IF(AND('R16 Designs 6-8'!N13>5,'R16 Designs 6-8'!N13<9),'R16 Designs 6-8'!N13,0)","v":0},null,null,null,null,null,"This sheet can also be used in manual mode: "]
[null,"2) Enter all result in sheets \"Input\" and fill 1 or 0  in row 3 in \"Input\"",null,null,null,null,null,null,null,null,null,"Intractions cannot be trusted",null,null,null,null,null,null,null,null,null,null,null,"Enter results of the runs in the table F18:I21 and F22:G29"]
[null,"3) Click on \"Start\" to load the first case.  Check that Next in cell K12 is 1",null,null,null,null,null,null,null,null,null,"Centerpoints may be omitted.",null,null,null,null,null,null,null,null,null,null,null,"Click on \"Update sheet\" to calculate results"]
[null,"4) See the results here",null,null,null,null,null,null,null,null,null,"With no replicates, no statistics is calculated",null,null,null,null,null,null,null,null,null,null,null,"You may set confidense interval manually, see below"]
[null,"5) Set confidence intervals for effects manually (see notes --->)",null,null,null,null,null,null,null,null,null,null,null,null,null,null,null,null,null,null,null,null,null,"Click on \"Save\" to save results to sheet \"Output\""]
[null,"6) Click \"Save\" or \"Save and load next analyte\" to save results and proceed"]
[null,null,null,null,null,null,null,null,null,null,null,null,null,null,null,null,null,null,null,null,null,null,"Most cells are shown with 2 significant digits. You may want to cange that for small values"]
["Design","Factor",1,2,3,4,5,6,7,8,"No of center points:",null,{"$f":"'R16 Designs 6-8'!N14","v":0},null,{"$f":"IF(T16=\"No\",\"Results are NOT saved\",\"Results are saved in sheet Output\")","v":"Results are saved in sheet Output"}]
{"$rows_left_out":118}
{"sheet":"Output","index":7,"n_rows":72,"n_cols":16,"rows_kept":72,"cut":false,"hidden":false,"merged":[]}
[{"$f":"'R16 Designs 4-5'!A1","v":"DOE_R16_Beta"},null,null,null,null,null,null,null,null,null,null,null,null,null,null,{"$f":"Input!AA1","v":"Author: Bo Svensmark, svensmark@plen.ku.dk, Analytical Chemistry, PLEN, 2015 - 2025"}]
[]
[]
[]
[]
[null,null,null,null,null,"No"]
[null,null,null,null,null,"Analyte"]
[null,null,null,null,null,"Relative area"]
[null,null,null,null,null,"Comments"]
["Factor","Name","Unit","Low","C1","C2","High"]
{"$rows_left_out":62}