{"text_format":"1","workbook":"xlsx","n_sheets":12,"sheets":["Info","Experimental data","Output","Input","Plots","Test of calibration function","Linear","2nd degree","3rd degree","Conc Raw","Conc Rounded","Standard deviations"],"not_rendered":{"charts":29,"images":0,"macros":1,"external_links":0,"defined_names":483,"comments":0,"pivot_tables":0},"unopened":[],"bounds":{"document_bytes":16777216,"sheet_cells":100000,"rows_first":2000,"rows_last":500,"rows_between":2000,"halvings":0,"cell_chars":16384,"cell_head_chars":4096},"cells_cut":0,"cells_raw":0,"read":"whole","date_system":"1900"}

{"sheet":"Info","index":0,"n_rows":30,"n_cols":16,"rows_kept":30,"cut":false,"hidden":false,"merged":[]}
["Calibration_Quant_8.15.xlsm",null,null,null,null,null,null,null,null,"Author: Bo Svensmark, svensmark@plen.ku.dk, Analytical Chemistry, PLEN, University of Copenhagen, 2017 - 2025"]
[]
[null,"Write any information you like in the white area",null,null,null,null,"Text in the white area can be edited anytime"]
[]
[null,"Created:",null,"25-05-20   14:37:34",null,null,null,null,null,null,null,null,null,null,null,"Output file: Filename after saving results"]
[null,"Input file:"]
[null,"Calibration file:",null,null,null,null,null,null,null,null,null,null,null,null,null,"If you want to save the output under a new name,"]
[null,"X-values:",null,null,null,null,null,null,null,null,null,null,null,null,null,"delete the filename in D10 and"]
[null,"Include custom samples:",null,null,null,null,null,null,null,null,null,null,null,null,null,"you can change the filename when saving"]
[null,"Output file:"]
{"$rows_left_out":21}
{"sheet":"Experimental data","index":1,"n_rows":183,"n_cols":87,"rows_kept":183,"cut":false,"hidden":false,"merged":[]}
[{"$f":"Info!$A$1","v":"Calibration_Quant_8.15.xlsm"},null,null,null,null,null,null,null,null,{"$f":"Info!$J$1","v":"Author: Bo Svensmark, svensmark@plen.ku.dk, Analytical Chemistry, PLEN, University of Copenhagen, 2017 - 2025"}]
[]
[null,null,null,null,null,null,null,null,null,"Execution key:"]
[]
[null,null,null,"24-03-02   15:32:24",null,null,null,null,null,"Table 0","Weighted?"]
[null,null,null,null,null,null,null,null,null,null,"Degree?"]
[null,"Save copies of graphs to sheet Plots?",null,null,null,"Yes","Yes/No","    Yes = big file",null,null,"Subtract blank"]
[null,null,null,null,null,null,null,null,null,null,"IS factor"]
["0) Go to sheet \"Input\"  and enter parameters in Table 1, Table 5 and Table 6",null,null,null,null,null,null,null,null,null,"Multiplier (not used)"]
[null,"These parameters in sheet \"Input\" will be used for all analyts (until changed)"]
{"$rows_left_out":174}
{"sheet":"Output","index":2,"n_rows":54,"n_cols":85,"rows_kept":54,"cut":false,"hidden":false,"merged":[]}
[{"$f":"Info!$A$1","v":"Calibration_Quant_8.15.xlsm"},null,null,null,null,"Output of results",null,null,null,{"$f":"Info!$J$1","v":"Author: Bo Svensmark, svensmark@plen.ku.dk, Analytical Chemistry, PLEN, University of Copenhagen, 2017 - 2025"}]
[]
["For all runs:",null,"Row 3 to 12:"]
[null,null,"Can be used for comments or"]
["a(DL) %",1,"calculations"]
["b(LOD) %",5]
["s(LOQ)",10,"Color codes for results:"]
["CI(LOQ)%",20,"Not detected"]
["a(LOQ) %",5,"Below blank limit"]
["a(Blank) %",10]
{"$rows_left_out":45}
{"sheet":"Input","index":3,"n_rows":62,"n_cols":30,"rows_kept":62,"cut":false,"hidden":false,"merged":[[3,29,10,36]]}
[{"$f":"Info!$A$1","v":"Calibration_Quant_8.15.xlsm"},null,null,"Input and estimation of weights",null,null,null,null,null,{"$f":"'Experimental data'!J1","v":"Author: Bo Svensmark, svensmark@plen.ku.dk, Analytical Chemistry, PLEN, University of Copenhagen, 2017 - 2025"},null,null,null,null,null,null,null,null,"This sheet is not protected, so take care only to change the white cells!",null,null,null,null,null,null,null,null,null,null,"Most formulas are standard mathematics. Regression calculated by matrix maths."]
["0) Start by saving the sheet under a new name: File->Save As",null,null,null,null,null,-4105]
["1a) Enter statistical parameters for all analytes here",null,null,null,null,null,"1b) User input for output Table 1&6",null,null,null,null,null,null,null,null,null,null,null,"Input X,Y and Yo must be in ascending order and without blank lines",null,null,null,null,null,null,null,null,null,null,"Detection limits are calculated according to:"]
["2) Enter values for the present analyte here (Calibration X,Y and unknown Yo's):",null,null,null,null,null,null,null,null,null,null,null,null,null,null,null,null,null,"Please start with a data set containing the max number of unknown samples and calibration points",null,null,null,null,null,null,null,null,null,null,"W. Funk, V. Dammann and G. Donnevert, Quality Assurance in Analytical Chemistry: Applications in Environmental, Food, and Materials Analysis, Biotechnology, and Medical Engineering, Second Edition. Wiley-VCH, Weinheim, 2007. See page 29-35 for detection limits. The detection limit DL is called the Decision limit XDL  and the limit of detection LOD is called the Minimum Detectable Value XMDV in Funk et al.."]
["      a) Enter X, Ymean and s(Y)  in column X, Y1  and s(Y)obs.     B23 = no of replicates"]
["or: b) Enter X and Y1-Y4 in column Y1-Y4. Leave s(Y)obs empty. B23 = 1",null,null,null,null,null,null,null,null,null,null,null,null,null,null,null,null,null,"A short explanation to Table 5:"]
["3) Enter manual values for s(Y) as function of X in Table 5, see explanation in column S and T",null,null,null,null,null,null,null,null,null,null,null,null,null,null,null,null,null,null,"In the white cells under manual enter values for s(Y) that will be used"]
["4) Press the button Copy X, Y and unknowns… to copy all values to the the other sheets",null,null,null,null,null,null,null,null,null,null,null,null,null,null,null,null,null,null,"for weighted regression."]
[null,null,null,null,null,null,null,null,null,null,null,null,null,null,null,null,null,null,null,"The input is the standard derviation at the lowest concentration in the"]
["Table 1: All analytes",null,null,"Table 5","See column S for an explanation",null,null,null,null,null,null,null,null,null,null,null,null,null,null,"calibration for an uncertainty that has:"]
{"$rows_left_out":53}
{"sheet":"Plots","index":4,"n_rows":0,"n_cols":0,"rows_kept":0,"cut":false,"hidden":false,"merged":[]}

{"sheet":"Test of calibration function","index":5,"n_rows":125,"n_cols":58,"rows_kept":125,"cut":false,"hidden":false,"merged":[]}
[{"$f":"Info!$A$1","v":"Calibration_Quant_8.15.xlsm"},null,null,"Test of calibration functions",null,null,null,null,null,{"$f":"'Experimental data'!J1","v":"Author: Bo Svensmark, svensmark@plen.ku.dk, Analytical Chemistry, PLEN, University of Copenhagen, 2017 - 2025"}]
[null,null,null,null,null,null,null,null,null,null,null,null,null,null,"This sheet is not protected, so take care only to change the white cells!",null,null,null,null,null,null,null,null,null,null,null,null,"Sum",{"$f":"SUM(AB19:AB48)","v":4.1339061699852486},null,"Statistical param",null,null,"SSreg",null,null,1,"Covariance matrix",null,2,"Covariance matrix",null,null,3,"Covariance matrix"]
["1) Look at the \"Statistics\" cell F10:K19, to see which polynomial degree is recommended.",null,null,null,null,null,null,null,null,null,null,null,null,null,"You may need to change the formatting of numbers in the tables depending on the magnitude of X and Y",null,null,null,null,null,null,null,null,null,null,null,null,"Norm",{"$f":"AF3/AC2","v":4.8380391759282162},null,"N",{"$f":"COUNT(X)*Input!B18","v":20},1,{"$f":"SUM(Q*(MMULT(X_1,AC12:AC13)-$AF$6)^2)","v":83.205122508434442},null,null,null,{"$f":"MINVERSE(MMULT(TRANSPOSE(X_1),X_1))","v":6.2878425784747449E-2},-1.1912763675928224E-4,null,{"$f":"MINVERSE(MMULT(TRANSPOSE(X_2),X_2))","v":7.7410425506269337E-2},-5.1350533553694592E-4,4.9250170641268228E-7,null,{"$f":"MINVERSE(MMULT(TRANSPOSE(X_3),X_3))","v":9.4950402614330937E-2},-1.5101492512850836E-3,4.5405940549503998E-6,-3.312385082230969E-9]
["2) Look at the \"Accuracy (Error %)\" in cell L10:M19 to see, whether or not weighted regression is better or worse.",null,null,null,null,null,null,null,null,null,null,null,null,null,null,null,null,null,null,null,null,null,null,null,null,null,null,null,null,null,"Xmax",{"$f":"MAX(X)","v":901.07200000000012},2,{"$f":"SUM(Q*(MMULT(X_2,AE12:AE14)-$AF$6)^2)","v":83.205724468011226},null,null,null,-1.1912763675928221E-4,1.1019509742144923E-6,null,-5.135053355369482E-4,1.180479795148362E-5,-1.3365792275061089E-8,null,-1.5101492512851161E-3,6.8435378976662733E-5,-2.4338357306809037E-7,1.8821395367177193E-10]
["3) IMPORTANT - look at the plots of the calibration functions and the predicted error in X below ",null,null,null,null,null,null,null,null,null,null,null,null,null,null,null,null,null,null,null,null,null,null,null,null,null,null,"weights",null,null,"Xmin",{"$f":"MIN(X)","v":0.9010720000000001},3,{"$f":"SUM(Q*(MMULT(X_3,AG12:AG15)-$AF$6)^2)","v":83.207762296157426}]
["    OBS: Look careful at the function between datapoints - too high an order may give wrong results here even when the  statistics is ok",null,null,null,null,null,null,null,null,null,null,null,null,null,null,null,null,null,null,null,null,null,null,null,null,null,null,"w0",{"$f":"B22^2/$AC$3","v":0.20669530849926243},null,"Ymean",{"$f":"SUM(Y)/$AF$3","v":1.0263226511921715},4,{"$f":"SUM(Q*(MMULT(X_4,AI12:AI16)-$AF$6)^2)","v":83.208224853605856},null,null,"W 1","Covariance matrix",null,"W 2","Covariance matrix",null,null,"W 3","Covariance matrix"]
["4) Enter 1 or 0 in cell C26 to choose weighted or unweighted regression.",null,null,null,null,null,null,null,null,null,null,null,null,null,null,null,null,null,null,null,null,null,null,null,null,null,null,"w1",{"$f":"B23^2/$AC$3","v":0.22938822702210526},null,"Xmean",{"$f":"SUM(X)/$AF$3","v":108.10611320000002},"1W",{"$f":"SUM(W*(MMULT(X_1,AD12:AD13)-$AF$8)^2)","v":0.82058731383241179},null,null,null,{"$f":"MINVERSE(MMULT(MMULT(TRANSPOSE(X_1),W),X_1))","v":5.1310837851629224E-2},-3.7903566425387186E-4,null,{"$f":"MINVERSE(MMULT(MMULT(TRANSPOSE(X_2),W),X_2))","v":5.3222277510912075E-2},-1.116288456100698E-3,1.3632795179326655E-6,null,{"$f":"MINVERSE(MMULT(MMULT(TRANSPOSE(X_3),W),X_3))","v":5.5691892649316947E-2},-2.3614620860959532E-3,9.2622967448321034E-6,-7.4956541165939747E-9]
["6) Go to the sheet for the best calibration function (Linear, 2nd degree or 3rd degree) - 4th degree is not included",null,null,null,null,null,null,null,null,null,null,null,null,null,null,null,null,null,null,null,null,null,null,null,null,null,null,"w2",{"$f":"B24^2/$AC$3","v":0},null,"YmeanW",{"$f":"SUM(W*Y)/$AF$3","v":3.3897094703631926E-2},"2W",{"$f":"SUM(W*(MMULT(X_2,AF12:AF14)-$AF$8)^2)","v":0.82071582834005707},null,null,null,-3.7903566425387028E-4,1.0960015733281521E-4,null,-1.1162884561007167E-3,3.9396261494231374E-4,-5.2582440977527299E-7,null,-2.361462086095778E-3,1.0217759712523597E-3,-4.5084886722594459E-6,3.7792896149728467E-9]
[null,null,null,null,null,null,null,null,null,null,null,null,null,null,null,null,null,null,null,null,null,null,null,null,null,null,null,null,null,null,"XmeanW",{"$f":"SUM(W*X)/$AF$3","v":3.4583496363319894},"3W",{"$f":"SUM(W*(MMULT(X_3,AH12:AH15)-$AF$8)^2)","v":0.82081536566575797}]
["Calibration curve",null,null,null,null,"Polynomial fit",null,null,"Accuracy (Error %)",null,"Through",null,null,"Y = a0 + a1X + a2X^2 + a3X^3 + a4X^4",null,null,null,null,null,null,null,null,null,null,null,null,null,null,null,null,"SStotal",{"$f":"SUM(Q*(Y-$AF$6)^2)","v":83.20858250133432}]
{"$rows_left_out":116}
{"sheet":"Linear","index":6,"n_rows":188,"n_cols":56,"rows_kept":188,"cut":false,"hidden":false,"merged":[]}
[{"$f":"Info!$A$1","v":"Calibration_Quant_8.15.xlsm"},null,null,"Linear calibration",null,null,null,null,null,null,null,null,null,{"$f":"'Experimental data'!$J$1","v":"Author: Bo Svensmark, svensmark@plen.ku.dk, Analytical Chemistry, PLEN, University of Copenhagen, 2017 - 2025"}]
[null,null,null,null,null,null,{"$f":"Input!I15","v":1},{"$f":"Input!B25","v":"Naphthalene"},null,null,null,null,null,null,null,null,null,null,null,null,null,null,"Statistical param ",null,null,"Covariance matrix"]
[null,null,null,null,null,null,null,null,null,null,null,null,null,null,null,null,null,null,null,null,null,null,"Ymean",{"$f":"SUM(W*Y)/I9","v":3.3897094703631926E-2},null,{"$f":"MINVERSE(MMULT(MMULT(TRANSPOSE(X_1),W),X_1))","v":5.1310837851629224E-2},-3.7903566425387186E-4]
[null,null,null,null,null,null,{"$f":"IF(G6=0,\"Remember to save the results\",\"\")","v":"Remember to save the results"},null,null,null,"Comments to output",null,null,null,null,null,null,null,null,null,null,null,"Xmean",{"$f":"SUM(W*X)/I9","v":3.4583496363319894},null,-3.7903566425387028E-4,1.0960015733281521E-4]
[null,null,null,null,null,null,{"$f":"IF(G6=0,\"\",\"Results are saved\")","v":""},null,null,null,null,null,null,null,null,null,null,null,null,null,null,null,"SStotal",{"$f":"SUM(W*(Y-$X$3)^2)","v":0.82084956502241457}]
[null,null,null,null,null,null,{"$f":"'Test of calibration function'!C117","v":0},null,null,null,null,null,null,null,null,null,null,null,null,null,null,null,"SSreg",{"$f":"SUM(W*(MMULT(X_1,C9:C10)-X3)^2)","v":0.82058731383241179},null,null,null,null,null,null,null,null,null,null,null,null,null,null,null,"Detection limits to output:"]
[{"$f":"IF('Test of calibration function'!$C$26=0,\"Simple linear\",\"Weighted linear\")","v":"Weighted linear"},null,"Y = a0 + a1X",null,null,"Weights",null,"Statistics",null,null,"Subtract blank",null,{"$f":"IF(Input!N22=1,IF(H28=0,0,J28),0)","v":4.1241936111387227},null,null,null,null,null,null,null,null,null,"SSres",{"$f":"X5-X6","v":2.6225119000278241E-4},null,null,null,null,null,null,null,null,null,null,null,null,null,null,null,"LOQ-s",{"$f":"IF(L15=\"Ok\",K15,\"na\")","v":"na"}]
[{"$f":"IF('Test of calibration function'!$C$26=0,\"1\",\"W 1\") &IF(J11=0,\"\",\" ZERO\")","v":"W 1"},null,"Coeff","s","P",null,null,null,null,null,null,null,null,null,null,null,null,null,null,null,null,null,"Xmax",{"$f":"MAX(X)","v":901.07200000000012},null,null,null,null,null,null,null,null,null,null,null,null,null,null,null,"LOQ-ci",{"$f":"IF(L16=\"Ok\",K16,\"na\")","v":"na"}]
["a0",null,{"$f":"MMULT(MMULT(COV,MMULT(TRANSPOSE(X_1),W)),Y)","v":1.0998858050337706E-3},{"$f":"SQRT(Z3)*I12","v":8.6462349823587554E-4},{"$f":"IF('Test of calibration function'!C26=1,'Test of calibration function'!AN14,'Test of calibration function'!AN13)","v":0.21952771590704198},"C0",{"$f":"'Test of calibration function'!$C$22","v":1},"N",{"$f":"COUNT(X)*Input!B18","v":20},null,null,null,null,"This sheet is not protected, so take care only to change the white cells!",null,null,null,null,null,null,null,null,null,null,null,"LOQ data","D","Q","X",null,null,null,null,null,null,null,null,null,null,"DL",{"$f":"K19","v":0.33157482144865086}]
["a1",null,9.4834855776420382E-3,{"$f":"SQRT(AA4)*I12","v":3.9960238352241377E-5},{"$f":"TDIST(ABS(C10/D10),$I$9-$I$10,2)","v":6.4331330912574842E-33},"C½",{"$f":"'Test of calibration function'!$C$23","v":1.0534653429656149},"k",2,null,null,null,null,null,null,null,null,null,null,null,null,null,"Sum",{"$f":"SUM(Z16:Z45)","v":4.1339061699852486},null,{"$f":"IF(AC10>0,100*$I$12*SQRT(($X$14+AC10*$X$15+AC10^2*$X$16)/$D$16+MMULT(MMULT($AB10:$AC10,COV),TRANSPOSE($AB10:$AC10)))/($C$10*AC10),2*I15)","v":0.83824469503221277},{"$f":"(Z10-I15)/I15","v":-0.91617553049677869},1,{"$f":"K15","v":706.46399999999994},null,null,null,null,null,null,null,null,null,null,"LOD",{"$f":"K20","v":0.54680649407018467}]
{"$rows_left_out":179}
{"sheet":"2nd degree","index":7,"n_rows":188,"n_cols":56,"rows_kept":188,"cut":false,"hidden":false,"merged":[]}
[{"$f":"Info!$A$1","v":"Calibration_Quant_8.15.xlsm"},null,null,"2nd degree polynomial regression",null,null,null,null,null,null,null,null,null,{"$f":"'Experimental data'!$J$1","v":"Author: Bo Svensmark, svensmark@plen.ku.dk, Analytical Chemistry, PLEN, University of Copenhagen, 2017 - 2025"}]
[null,null,null,null,null,null,{"$f":"Input!I15","v":1},{"$f":"Input!B25","v":"Naphthalene"},null,null,null,null,null,null,null,null,null,null,null,null,null,null,"Statistical param ",null,null,"Covariance matrix"]
[null,null,null,null,null,null,null,null,null,null,null,null,null,null,null,null,null,null,null,null,null,null,"Ymean",{"$f":"SUM(W*Y)/I9","v":3.3897094703631926E-2},null,{"$f":"MINVERSE(MMULT(MMULT(TRANSPOSE(X_1),W),X_1))","v":5.3222277510912075E-2},-1.116288456100698E-3,1.3632795179326655E-6]
[null,null,null,null,null,null,{"$f":"IF(G6=0,\"Remember to save the results\",\"\")","v":"Remember to save the results"},null,null,null,"Comments to output",null,null,null,null,null,null,null,null,null,null,null,"Xmean",{"$f":"SUM(W*X)/I9","v":3.4583496363319894},null,-1.1162884561007167E-3,3.9396261494231374E-4,-5.2582440977527299E-7]
[null,null,null,null,null,null,{"$f":"IF(G6=0,\"\",\"Results are saved\")","v":""},null,null,null,null,null,null,null,null,null,null,null,null,null,null,null,"SStotal",{"$f":"SUM(W*(Y-$X$3)^2)","v":0.82084956502241457},null,1.3632795179327187E-6,-5.258244097752731E-7,9.7232001804966352E-10]
[null,null,null,null,null,null,{"$f":"'Test of calibration function'!C117","v":0},null,null,null,null,null,null,null,null,null,null,null,null,null,null,null,"SSreg",{"$f":"SUM(W*(MMULT(X_1,C9:C11)-X3)^2)","v":0.82071582834005707},null,null,null,null,null,null,null,null,null,null,null,null,null,null,null,"Detection limits to output:"]
[{"$f":"IF('Test of calibration function'!$C$26=0,\"Simple 2nd degr.\",\"Weighted 2nd degr.\")","v":"Weighted 2nd degr."},null,null,"Y = a0 + a1X + a2X^2",null,"Weigths",null,"Statistics",null,null,"Subtract blank",null,{"$f":"IF(Input!N22=1,IF(H28=0,0,J28),0)","v":4.1550445712677506},null,null,null,null,null,null,null,null,null,"SSres",{"$f":"X5-X6","v":1.3373668235749925E-4},null,null,null,null,null,null,null,null,null,null,null,null,null,null,null,"LOQ-s",{"$f":"IF(L15=\"Ok\",K15,\"na\")","v":2.8962819655932543}]
[{"$f":"IF('Test of calibration function'!$C$26=0,\"2\",\"W 2\")&IF(J11=0,\"\",\" ZERO\")","v":"W 2"},null,"Coeff","Calibration_6.1_Quant_2.xlsm","P",null,null,null,null,null,null,null,null,null,null,null,null,null,null,null,null,null,"Xmax",{"$f":"MAX(X)","v":901.07200000000012},null,null,null,null,null,null,null,null,null,null,null,null,null,null,null,"LOQ-ci",{"$f":"IF(L16=\"Ok\",K16,\"na\")","v":3.1505491301895931}]
["a0",null,{"$f":"MMULT(MMULT(COV,MMULT(TRANSPOSE(X_1),W)),Y)","v":1.5955144227566319E-3},{"$f":"SQRT(Z3)*$I$12","v":6.4706444909568429E-4},{"$f":"IF('Test of calibration function'!C26=1,'Test of calibration function'!AR14,'Test of calibration function'!AR13)","v":2.4609632303770567E-2},"s0",{"$f":"'Test of calibration function'!$C$22","v":1},"N",{"$f":"COUNT(X)*Input!B18","v":20},null,null,null,null,"This sheet is not protected, so take care only to change the white cells!",null,null,null,null,null,null,null,null,null,null,null,"LOQ data","D","Q","X","X2",null,null,null,null,null,null,null,null,null,"DL",{"$f":"K19","v":0.30009674612425435}]
["a1",null,9.292318893221024E-3,{"$f":"SQRT(AA4)*$I$12","v":5.5670909657330968E-5},{"$f":"TDIST(ABS(C10/D10),$I$9-$I$10,2)","v":9.0071365261131466E-29},"s½",{"$f":"'Test of calibration function'!$C$23","v":1.0534653429656149},"k",3,null,null,null,null,null,null,null,null,null,null,null,null,null,"Sum",{"$f":"SUM(Z16:Z45)","v":4.1339061699852486},null,{"$f":"IF(AC10>0,100*$I$12*SQRT(($X$14+AC10*$X$15+AC10^2*$X$16)/$D$16+MMULT(MMULT($AB10:$AD10,COV),TRANSPOSE($AB10:$AD10)))/(($C$10+2*$C$11*$AC$10)*AC10),2*I15)","v":9.9999958809711487},{"$f":"(Z10-I15)/I15","v":-4.1190288513348605E-7},1,{"$f":"K15","v":2.8962819655932543},{"$f":"AC10^2","v":8.3884492242207251},null,null,null,null,null,null,null,null,null,"LOD",{"$f":"K20","v":0.49216467595458002}]
{"$rows_left_out":179}
{"sheet":"3rd degree","index":8,"n_rows":188,"n_cols":56,"rows_kept":188,"cut":false,"hidden":false,"merged":[]}
[{"$f":"Info!$A$1","v":"Calibration_Quant_8.15.xlsm"},null,null,"3rd degree polynomial regression",null,null,null,null,null,null,null,null,null,{"$f":"'Experimental data'!$J$1","v":"Author: Bo Svensmark, svensmark@plen.ku.dk, Analytical Chemistry, PLEN, University of Copenhagen, 2017 - 2025"}]
[null,null,null,null,null,null,{"$f":"Input!I15","v":1},{"$f":"Input!B25","v":"Naphthalene"},null,null,null,null,null,null,null,null,null,null,null,null,null,null,"Statistical param ",null,null,"Covariance matrix"]
[null,null,null,null,null,null,null,null,null,null,null,2,null,null,null,null,null,null,null,null,null,null,"Ymean",{"$f":"SUM(W*Y)/I9","v":3.3897094703631926E-2},null,{"$f":"MINVERSE(MMULT(MMULT(TRANSPOSE(X_1),W),X_1))","v":5.5691892649316947E-2},-2.3614620860959532E-3,9.2622967448321034E-6,-7.4956541165939747E-9]
[null,null,null,null,null,null,{"$f":"IF(G6=0,\"Remember to save the results\",\"\")","v":"Remember to save the results"},null,null,null,"Comments to output",null,null,null,null,null,null,null,null,null,null,null,"Xmean",{"$f":"SUM(W*X)/I9","v":3.4583496363319894},null,-2.361462086095778E-3,1.0217759712523597E-3,-4.5084886722594459E-6,3.7792896149728467E-9]
[null,null,null,null,null,null,{"$f":"IF(G6=0,\"\",\"Results are saved\")","v":""},null,null,null,null,null,null,null,null,null,null,null,null,null,null,null,"SStotal",{"$f":"SUM(W*(Y-$X$3)^2)","v":0.82084956502241457},null,9.2622967448297131E-6,-4.5084886722594908E-6,2.6237176950840893E-8,-2.3974707667252756E-11]
[null,null,null,null,null,null,{"$f":"'Test of calibration function'!C117","v":0},null,null,null,null,null,null,null,null,null,null,null,null,null,null,null,"SSreg",{"$f":"SUM(W*(MMULT(X_1,C9:C12)-X3)^2)","v":0.82081536566575797},null,-7.4956541165945868E-9,3.7792896149729153E-9,-2.3974707667252872E-11,2.2750439840576188E-14,null,null,null,"DL/LOD ","Target","D","Q","X","X2","X3","Detection limits to output:"]
[{"$f":"IF('Test of calibration function'!$C$26=0,\"Simple 3rd degr.\",\"Weighted 3rd degr.\")","v":"Weighted 3rd degr."},null," Y = a0 + a1X + a2X^2 + a3X^3",null,null,"Weigthts",null,"Statistics",null,null,"Subtract blank =",null,{"$f":"IF(Input!N22=1,IF(H28=0,0,J28),0)","v":0},null,null,null,null,null,null,null,null,null,"SSres",{"$f":"X5-X6","v":3.4199356656605673E-5},null,null,null,null,null,null,null,null,{"$f":"MMULT(AJ7:AM7,$C$9:$C$12)-$C$9","v":2.4620367220524429E-2},{"$f":"SQRT((J19*TINV(J23/50,I19-1))^2+(D9*TINV(J23/50,I9-I10))^2)","v":2.4108352309694047E-3},{"$f":"(AG7-AH7)/AH7","v":9.2123807153027624},1,{"$f":"K19","v":2.7212032289915391},{"$f":"AK7^2","v":7.4049470134739792},{"$f":"AK7^3","v":20.150365723576645},"LOQ-s",{"$f":"IF(L15=\"Ok\",K15,\"na\")","v":"na"}]
[{"$f":"IF('Test of calibration function'!$C$26=0,\"3\",\"W 3\")&IF(J11=0,\"\",\" ZERO\")","v":"W 3"},null,"Coeff","s","P",null,null,null,null,null,"Please check the predicted Xo",null,null,null,"This sheet is not protected, so take care only to change the white cells!",null,null,null,null,null,null,null,"Xmax",{"$f":"MAX(X)","v":901.07200000000012},null,null,null,null,null,null,null,null,{"$f":"MMULT(AJ8:AM8,$C$9:$C$12)-$C$9","v":2.9572064148753859E-2},{"$f":"AH7+SQRT((J19*TINV(J24/50,I19-1))^2+(D9*TINV(J24/50,I9-I10))^2)","v":3.9211949503598353E-3},{"$f":"(AG8-AH8)/AH8","v":6.5415949788571783},1,{"$f":"K20","v":3.2681156690035658},{"$f":"AK8^2","v":10.680580025986623},{"$f":"AK8^3","v":34.905370936973398},"LOQ-ci",{"$f":"IF(L16=\"Ok\",K16,\"na\")","v":"na"}]
["a0",null,{"$f":"MMULT(MMULT(COV,MMULT(TRANSPOSE(X_1),W)),Y)","v":2.0913156798894588E-3},{"$f":"SQRT(Z3)*$I$12","v":3.4502055188743704E-4},{"$f":"IF('Test of calibration function'!C26=1,'Test of calibration function'!AV14,'Test of calibration function'!AV13)","v":1.6496234215527082E-5},"s0",{"$f":"'Test of calibration function'!$C$22","v":1},"N",{"$f":"COUNT(X)*Input!B18","v":20},null,"carefully. If they looks wrong",null,null,null,null,null,null,null,null,null,null,null,null,null,null,"LOQ data","D","Q","X","X2","X3",null,null,null,null,null,null,null,null,"DL",{"$f":"IF(I19=0,\"na\",IF(L19=\"Ok\",K19,\"na\"))","v":"na"}]
["a1",null,9.0423371688018589E-3,{"$f":"SQRT(AA4)*$I$12","v":4.6733339854974737E-5},{"$f":"TDIST(ABS(C10/D10),$I$9-$I$10,2)","v":2.1786846145954799E-28},"s½",{"$f":"'Test of calibration function'!$C$23","v":1.0534653429656149},"k",4,null,"enter resonable starting values ",null,null,null,"· Many calculations are performed by Solver using macros:",null,null,null,null,null,null,null,"Sum",{"$f":"SUM(Z16:Z45)","v":4.1339061699852486},null,{"$f":"IF(AC10>0,100*$I$12*SQRT(($X$14+AC10*$X$15+AC10^2*$X$16)/$D$16+MMULT(MMULT($AB10:$AE10,COV),TRANSPOSE($AB10:$AE10)))/(($C$10+AC10*(2*$C$11+$AC10*3*$C$12))*AC10),2*I15)","v":9.3962432902186013},{"$f":"(Z10-I15)/I15","v":-6.0375670978139874E-2},1,{"$f":"K15","v":1.2763886444648465},{"$f":"AC10^2","v":1.6291679717188081},{"$f":"AC10^3","v":2.0794514990277126},null,null,null,null,null,null,null,null,"LOD",{"$f":"IF(I19=0,\"na\",IF(L20=\"Ok\",K20,\"na\"))","v":"na"}]
{"$rows_left_out":179}
{"sheet":"Conc Raw","index":9,"n_rows":0,"n_cols":0,"rows_kept":0,"cut":false,"hidden":false,"merged":[]}

{"sheet":"Conc Rounded","index":10,"n_rows":0,"n_cols":0,"rows_kept":0,"cut":false,"hidden":false,"merged":[]}

{"sheet":"Standard deviations","index":11,"n_rows":0,"n_cols":0,"rows_kept":0,"cut":false,"hidden":false,"merged":[]}